View Single Post
Old 03-06-2010, 15:05   #1 (permalink)
Chennairam
No Life Poster
 
Chennairam's Avatar
 
Join Date: Oct 2006
Location: Chennai - India
Age: 33
Posts: 997
Member: 372320
Status: Offline
Sonork: 100.113211
Thanks Meter: 2,661
Thumbs up Few tries later Sucessfully Flashed 5220 01:43

HEre the error Logs


Try 1
Quote:
20:07:51 : Processing : rm411__07.23.mcusw
20:07:51 : Total blocks to write : 1289
20:07:51 : >> CMT Rootkey Hash CERT : NOLO
20:07:53 : >> CMT Rootkey Hash CERT : KEYS
20:07:53 : >> CMT Rootkey Hash CERT : PRIMAPP
20:07:53 : >> CMT Rootkey Hash CERT : PASUBTOC
20:07:54 : Flashing FAILED
20:07:54 : Operations Failed....
try2
Quote:
20:08:18 : Processing : rm411__07.23.mcusw
20:08:18 : Total blocks to write : 1289
20:08:18 : >> CMT Rootkey Hash CERT : NOLO
20:08:18 : >> CMT Rootkey Hash CERT : KEYS
20:08:18 : >> CMT Rootkey Hash CERT : PRIMAPP
20:08:18 : >> CMT Rootkey Hash CERT : PASUBTOC
20:08:18 : >> CMT Rootkey Hash CERT : PAPUBKEYS
20:08:18 : >> CMT Rootkey Hash CERT : UPDAPP
20:08:25 : Flashing FAILED
20:08:25 : Operations Failed....

try3
Quote:
20:08:46 : Processing : rm411__07.23.mcusw
20:08:46 : Total blocks to write : 1289
20:08:47 : >> CMT Rootkey Hash CERT : NOLO
20:08:47 : >> CMT Rootkey Hash CERT : KEYS
20:08:47 : >> CMT Rootkey Hash CERT : PRIMAPP
20:08:47 : >> CMT Rootkey Hash CERT : PASUBTOC
20:08:47 : >> CMT Rootkey Hash CERT : PAPUBKEYS
20:08:47 : >> CMT Rootkey Hash CERT : UPDAPP
20:09:08 : Flashing FAILED
20:09:08 : Operations Failed....


Try 4 Sucessfully Flashed




after Flash fbus Check ... it say security test failed .. but phone working good




Br
Ram
  Reply With Quote
 
Page generated in 0.22729 seconds with 6 queries